FEDORA-2014-12024 created by karsten 5 years ago for Fedora 21
stable

fix libdir on new 64bit archs, aarch64 and ppc64le

How to install

sudo dnf upgrade --advisory=FEDORA-2014-12024

This update has been submitted for testing by karsten.

5 years ago

AutoQA: depcheck test PASSED on x86_64. Result log: http://autoqa.fedoraproject.org/report/1hic4 (results are informative only)

AutoQA: depcheck test PASSED on i386. Result log: http://autoqa.fedoraproject.org/report/1hicb (results are informative only)

This update is currently being pushed to the Fedora 21 testing updates repository.

5 years ago

This update has been pushed to testing

5 years ago

This update has reached 3 days in testing and can be pushed to stable now if the maintainer wishes

5 years ago
User Icon cairo provided feedback 5 years ago
karma

This update has been submitted for stable by pbrobinson.

5 years ago

Taskotron: upgradepath test FAILED on noarch. Result log: https://taskotron.fedoraproject.org/taskmaster//builders/x86_64/builds/14344/steps/runtask/logs/stdio (results are informative only)

Automatic push to stable based on karma has been disabled for this update due to failure of an AutoQA test. Update submitter, please check the AutoQA test result and see if there is a valid problem to be fixed here, and fix it if so. If the failure is a mistake on AutoQA's part, you can re-enable the automatic push feature for this update if you like, or push it stable manually once it reaches the requirements under the Updates Policy.

5 years ago

Taskotron: depcheck test PASSED on i386. Result log: https://taskotron.fedoraproject.org/taskmaster//builders/x86_64/builds/14343/steps/runtask/logs/stdio (results are informative only)

Taskotron: depcheck test PASSED on x86_64. Result log: https://taskotron.fedoraproject.org/taskmaster//builders/x86_64/builds/14343/steps/runtask/logs/stdio (results are informative only)

Taskotron: upgradepath test FAILED on noarch. Result log: https://taskotron.fedoraproject.org/taskmaster//builders/x86_64/builds/15145/steps/runtask/logs/stdio (results are informative only)

Taskotron: upgradepath test FAILED on noarch. Result log: https://taskotron.fedoraproject.org/taskmaster//builders/x86_64/builds/16049/steps/runtask/logs/stdio (results are informative only)

Taskotron: upgradepath test FAILED on noarch. Result log: https://taskotron.fedoraproject.org/taskmaster//builders/x86_64/builds/16901/steps/runtask/logs/stdio (results are informative only)

Taskotron: upgradepath test FAILED on noarch. Result log: https://taskotron.fedoraproject.org/taskmaster//builders/x86_64/builds/17589/steps/runtask/logs/stdio (results are informative only)

Taskotron: upgradepath test FAILED on noarch. Result log: https://taskotron.fedoraproject.org/taskmaster//builders/x86_64/builds/18684/steps/runtask/logs/stdio (results are informative only)

This update is currently being pushed to the Fedora 21 stable updates repository.

5 years ago

This update is currently being pushed to the Fedora 21 stable updates repository.

5 years ago

This update has been pushed to stable

5 years ago

Please login to add feedback.

Metadata
Type
bugfix
Karma
1
Signed
Content Type
RPM
Test Gating
Settings
Unstable by Karma
-3
Dates
submitted
5 years ago
in testing
5 years ago
in stable
5 years ago

Automated Test Results