Fix the glib assertion.

How to install

sudo dnf upgrade --advisory=FEDORA-2015-0821
This update has been submitted for testing by tagoh. 4 years ago

Taskotron: depcheck test FAILED on i386. Result log: https://taskotron.fedoraproject.org/taskmaster//builders/x86_64/builds/28228/steps/runtask/logs/stdio (results are informative only)

Automatic push to stable based on karma has been disabled for this update due to failure of an AutoQA test. Update submitter, please check the AutoQA test result and see if there is a valid problem to be fixed here, and fix it if so. If the failure is a mistake on AutoQA's part, you can re-enable the automatic push feature for this update if you like, or push it stable manually once it reaches the requirements under the Updates Policy. 4 years ago

Taskotron: depcheck test FAILED on x86_64. Result log: https://taskotron.fedoraproject.org/taskmaster//builders/x86_64/builds/28228/steps/runtask/logs/stdio (results are informative only)

This update is currently being pushed to the Fedora 21 testing updates repository. 4 years ago
This update has been pushed to testing 4 years ago
User Icon arehtykitna commented & provided feedback 4 years ago
karma

i686 no regressions noticed

User Icon krnowak commented & provided feedback 4 years ago
karma

Can't update. dnf --best upgrade Error: nothing provides /usr/bin/dbus-send needed by imsettings-1.6.8-1.fc21.x86_64. nothing provides /usr/bin/dbus-send needed by imsettings-1.6.8-1.fc21.x86_64. nothing provides /usr/bin/dbus-send needed by imsettings-1.6.8-1.fc21.x86_64

tagoh has edited this update. New build(s): imsettings-1.6.8-2.fc21. Removed build(s): imsettings-1.6.8-1.fc21. 4 years ago
This update has been submitted for testing by tagoh. 4 years ago

Taskotron: depcheck test PASSED on i386. Result log: https://taskotron.fedoraproject.org/taskmaster//builders/x86_64/builds/30244/steps/runtask/logs/stdio (results are informative only)

Taskotron: depcheck test PASSED on x86_64. Result log: https://taskotron.fedoraproject.org/taskmaster//builders/x86_64/builds/30244/steps/runtask/logs/stdio (results are informative only)

This update is currently being pushed to the Fedora 21 testing updates repository. 4 years ago
This update has been pushed to testing 4 years ago
User Icon pnemade commented & provided feedback 4 years ago
karma

looks good and now no broken deps with dnf

User Icon krnowak commented & provided feedback 4 years ago
karma

Had no problem with installing it.

User Icon yuwata commented & provided feedback 4 years ago
karma

Works for me

This update has reached the stable karma threshold and will be pushed to the stable updates repository 4 years ago

Taskotron: upgradepath test FAILED on noarch. Result log: https://taskotron.fedoraproject.org/taskmaster//builders/x86_64/builds/31832/steps/runtask/logs/stdio (results are informative only)

Automatic push to stable based on karma has been disabled for this update due to failure of an AutoQA test. Update submitter, please check the AutoQA test result and see if there is a valid problem to be fixed here, and fix it if so. If the failure is a mistake on AutoQA's part, you can re-enable the automatic push feature for this update if you like, or push it stable manually once it reaches the requirements under the Updates Policy. 4 years ago

Taskotron: depcheck test PASSED on i386. Result log: https://taskotron.fedoraproject.org/taskmaster//builders/x86_64/builds/31833/steps/runtask/logs/stdio (results are informative only)

Taskotron: depcheck test PASSED on x86_64. Result log: https://taskotron.fedoraproject.org/taskmaster//builders/x86_64/builds/31833/steps/runtask/logs/stdio (results are informative only)

This update is currently being pushed to the Fedora 21 stable updates repository. 4 years ago
This update has been pushed to stable 4 years ago

Please login to add feedback.

Metadata
Type
bugfix
Karma
3
Signed
Content Type
RPM
Test Gating
Settings
Unstable by Karma
-3
Dates
submitted
4 years ago
in testing
4 years ago
in stable
4 years ago
modified
4 years ago
BZ#1181765 com.redhat.imsettings critical assertion failure "g_dbus_method_invocation_return_value_internal: assertion '(parameters == NULL) || g_variant_is_of_type (parameters, G_VARIANT_TYPE_TUPLE)' failed" on login
0
0
BZ#1184525 Cannot install imsettings update due to changed dbus-send location
0
0

Automated Test Results

Test Cases

0 0 Test Case imsettings enable