fixes in packaging for f23+ to use py3 version, some fixes in plugins, new plugin: debug

How to install

sudo dnf upgrade --advisory=FEDORA-2015-2793

This update has been submitted for testing by ignatenkobrain.

7 years ago
User Icon lslebodn commented & provided feedback 7 years ago
karma

+1

Taskotron: depcheck test FAILED on i386. Result log: https://taskotron.fedoraproject.org/taskmaster//builders/x86_64/builds/41949/steps/runtask/logs/stdio (results are informative only)

Automatic push to stable based on karma has been disabled for this update due to failure of an AutoQA test. Update submitter, please check the AutoQA test result and see if there is a valid problem to be fixed here, and fix it if so. If the failure is a mistake on AutoQA's part, you can re-enable the automatic push feature for this update if you like, or push it stable manually once it reaches the requirements under the Updates Policy.

7 years ago

Taskotron: depcheck test FAILED on x86_64. Result log: https://taskotron.fedoraproject.org/taskmaster//builders/x86_64/builds/41949/steps/runtask/logs/stdio (results are informative only)

ignatenkobrain has edited this update. New build(s): dnf-plugins-extras-0.0.5-2.fc22. Removed build(s): dnf-plugins-extras-0.0.5-1.fc22.

7 years ago

Taskotron: depcheck test FAILED on i386. Result log: https://taskotron.fedoraproject.org/taskmaster//builders/x86_64/builds/41995/steps/runtask/logs/stdio (results are informative only)

Taskotron: depcheck test FAILED on x86_64. Result log: https://taskotron.fedoraproject.org/taskmaster//builders/x86_64/builds/41995/steps/runtask/logs/stdio (results are informative only)

This update is currently being pushed to the Fedora 22 testing updates repository.

7 years ago

This update has been pushed to testing

7 years ago

ignatenkobrain has edited this update. New build(s): dnf-plugins-extras-0.0.5-3.fc22. Removed build(s): dnf-plugins-extras-0.0.5-2.fc22.

7 years ago

This update has been submitted for testing by ignatenkobrain.

7 years ago

Taskotron: depcheck test PASSED on i386. Result log: https://taskotron.fedoraproject.org/taskmaster//builders/x86_64/builds/42357/steps/runtask/logs/stdio (results are informative only)

Taskotron: depcheck test PASSED on x86_64. Result log: https://taskotron.fedoraproject.org/taskmaster//builders/x86_64/builds/42357/steps/runtask/logs/stdio (results are informative only)

User Icon iddnna commented & provided feedback 7 years ago
karma

no problem tested in 86_64

User Icon lslebodn commented & provided feedback 7 years ago
karma

works for me on 86_64 as well BZ1192779 is fixed

This update is currently being pushed to the Fedora 22 testing updates repository.

7 years ago

This update has been pushed to testing

7 years ago
User Icon michich commented & provided feedback 7 years ago
karma

The python-* renaming seems to be missing some Obsoletes or something: # dnf update [...] Installing: python-dnf-plugins-extras-common noarch 0.0.5-3.fc22 updates-testing 23 k python-dnf-plugins-extras-snapper noarch 0.0.5-3.fc22 updates-testing 15 k replacing dnf-plugins-extras-snapper.noarch 0.0.4-1.fc22 [...] Error: Transaction check error: file /usr/lib/python2.7/site-packages/dnfpluginsextras/init.pyc from install of python-dnf-plugins-extras-common-0.0.5-3.fc22.noarch conflicts with file from package dnf-plugins-extras-common-0.0.4-1.fc22.noarch [...]

This update has reached 3 days in testing and can be pushed to stable now if the maintainer wishes

7 years ago
User Icon salimma commented & provided feedback 7 years ago
karma

Confirmed that tracer plugin now works

This update has been submitted for stable by ignatenkobrain.

7 years ago

ignatenkobrain has edited this update. New build(s): dnf-plugins-extras-0.0.5-4.fc22. Removed build(s): dnf-plugins-extras-0.0.5-3.fc22.

7 years ago

This update has been submitted for testing by ignatenkobrain.

7 years ago

Taskotron: depcheck test PASSED on i386. Result log: https://taskotron.fedoraproject.org/taskmaster//builders/x86_64/builds/49749/steps/runtask/logs/stdio (results are informative only)

Taskotron: depcheck test PASSED on x86_64. Result log: https://taskotron.fedoraproject.org/taskmaster//builders/x86_64/builds/49749/steps/runtask/logs/stdio (results are informative only)

This update is currently being pushed to the Fedora 22 testing updates repository.

7 years ago

This update has been pushed to testing

7 years ago
User Icon michich commented & provided feedback 7 years ago
karma

No dependency problems now. Tracer works too.

This update has been submitted for stable by ignatenkobrain.

7 years ago

Taskotron: upgradepath test PASSED on noarch. Result log: https://taskotron.fedoraproject.org/taskmaster//builders/x86_64/builds/53791/steps/runtask/logs/stdio (results are informative only)

Taskotron: upgradepath test FAILED on noarch. Result log: https://taskotron.fedoraproject.org/taskmaster//builders/x86_64/builds/55543/steps/runtask/logs/stdio (results are informative only)

Automatic push to stable based on karma has been disabled for this update due to failure of an AutoQA test. Update submitter, please check the AutoQA test result and see if there is a valid problem to be fixed here, and fix it if so. If the failure is a mistake on AutoQA's part, you can re-enable the automatic push feature for this update if you like, or push it stable manually once it reaches the requirements under the Updates Policy.

7 years ago

Taskotron: upgradepath test FAILED on noarch. Result log: https://taskotron.fedoraproject.org/taskmaster//builders/x86_64/builds/56797/steps/runtask/logs/stdio (results are informative only)

Taskotron: upgradepath test FAILED on noarch. Result log: https://taskotron.fedoraproject.org/taskmaster//builders/x86_64/builds/57696/steps/runtask/logs/stdio (results are informative only)

Taskotron: upgradepath test FAILED on noarch. Result log: https://taskotron.fedoraproject.org/taskmaster//builders/x86_64/builds/58870/steps/runtask/logs/stdio (results are informative only)

Taskotron: upgradepath test FAILED on noarch. Result log: https://taskotron.fedoraproject.org/taskmaster//builders/x86_64/builds/59762/steps/runtask/logs/stdio (results are informative only)

This update is currently being pushed to the Fedora 22 stable updates repository.

7 years ago

This update is currently being pushed to the Fedora 22 stable updates repository.

7 years ago

This update has been pushed to stable

7 years ago

Please login to add feedback.

Metadata
Type
bugfix
Karma
1
Signed
Content Type
RPM
Test Gating
Settings
Unstable by Karma
-3
Stable by Karma
disabled
Stable by Time
disabled
Dates
submitted
7 years ago
in testing
7 years ago
in stable
7 years ago
modified
7 years ago
BZ#1187763 [abrt] dnf: tracer.py:59:transaction:NameError: global name 'installed' is not defined
0
0
BZ#1192779 [abrt] python3-dnf: tracer.py:93:_print_output:TypeError: Type str doesn't support the buffer API
0
0

Automated Test Results