Update to latest upstream release + arduino-listSerialPortsC (new package)

This update has been submitted for testing by giallu.

3 years ago

This update has been pushed to testing.

3 years ago
User Icon jenslody commented & provided feedback 3 years ago
karma

I can not update arduino in F26 due to broken dependency on arduino-listSerialPortsC :

Problem: cannot install the best update candidate for package arduino-1:1.6.6-3.fc26.noarch - nothing provides arduino-listSerialPortsC needed by arduino-1:1.8.4-1.fc26.noarch

Bodhi is disabling automatic push to stable due to negative karma. The maintainer may push manually if they determine that the issue is not severe.

3 years ago

spot edited this update.

New build(s):

  • arduino-listSerialPortsC-1.4.0-1.fc26

Karma has been reset.

3 years ago

This update has been submitted for testing by spot.

3 years ago

This update has been pushed to testing.

3 years ago
User Icon vkrizan commented & provided feedback 3 years ago
karma

Cannot compile sketch with Serial, there seems to be a gcc bug and the new Arduino possibly changed some compilation flags.

Linking everything together...
"/usr/bin/avr-gcc"  -Os -g -flto -fuse-linker-plugin -Wl,--gc-sections -mmcu=atmega328p  -o "/tmp/arduino_build_314883/DigitalReadSerial.ino.elf" "/tmp/arduino_build_314883/sketch/DigitalReadSerial.ino.cpp.o" "/tmp/arduino_build_314883/core/core.a" "-L/tmp/arduino_build_314883" -lm
lto1: internal compiler error: Segmentation fault
Please submit a full bug report,
with preprocessed source if appropriate.
See <https://bugzilla.redhat.com/> for instructions.
lto-wrapper: fatal error: /usr/bin/avr-gcc returned 1 exit status
compilation terminated.
/usr/lib/gcc/avr/6.3.0/../../../../avr/bin/ld: error: lto-wrapper failed
collect2: error: ld returned 1 exit status
BZ#1435029 arduino-1.8.4 is available

This update has reached 7 days in testing and can be pushed to stable now if the maintainer wishes

3 years ago
User Icon dulsi commented & provided feedback 3 years ago
karma

I tried to compile by viobyte project. I get the following error:

avr-g++: error: missing filename after '-o' exit status 1 Error compiling for board Arduino Pro or Pro Mini.

It compiles properly with Arduino 1.6.6.

User Icon c2e commented & provided feedback 3 years ago

Unable to compile for mega or mega 2560. getting the error: Error compiling for board Arduino/Genuino Mega or Mega 2560. Parameter "tools" is mandatory Usage of /usr/share/arduino/arduino-builder: several lines related to "build" follow the last line

User Icon c2e commented & provided feedback 3 years ago

What is the status of this update are we going to be able to get a stable working version of 1.8.4? really need some help with this.......

User Icon giallu commented & provided feedback 3 years ago

I just pushed an 1.8.5 update

User Icon giallu commented & provided feedback 3 years ago

Correction. I am trying to push an updated build but I am getting some errors in the web interface as I tried to add the same packages we had here. I will try with the command line

User Icon ktdreyer commented & provided feedback 3 years ago
karma

Servo.h is missing from the latest package

This update has been obsoleted.

3 years ago

Please login to add feedback.

Metadata
Type
enhancement
Karma
-3
Signed
Content Type
RPM
Test Gating
Settings
Unstable by Karma
-3
Stable by Karma
disabled
Stable by Time
disabled
Dates
submitted
3 years ago
in testing
3 years ago
modified
3 years ago
BZ#1435029 arduino-1.8.4 is available
0
1

Automated Test Results